Target
Cannabinoid receptor 1
Ligand
BDBM50256170
Substrate
Meas. Tech.
ChEMBL_515074 (CHEMBL1034816)
IC50
262.2±n/a nM
Citation
 Hou, DRAlam, SKuan, TCRamanathan, MLin, TPHung, MS 1,2,3-Triazole derivatives as new cannabinoid CB1 receptor antagonists. Bioorg Med Chem Lett 19:1022-5 (2009)  
Target
Name:
Cannabinoid receptor 1
Synonyms:
CANN6 CB-R CNR CNR1_HUMAN Cannabinoid receptor Cannabinoid receptor 1 (brain)
Type:
G Protein-Coupled Receptor (GPCR)
Mol. Mass.:
52868.96
Organism:
Homo sapiens (Human)
Description:
P21554
Residue:
472
  
Inhibitor
Name:
BDBM50256170
Synonyms:
2-(4-(4-chlorophenyl)-5-(2,4-dichlorophenyl)-2H-1,2,3-triazol-2-yl)-N-(2-fluorobenzyl)acetamide | CHEMBL482308
Type:
Small organic molecule
Emp. Form.:
C23H16Cl3FN4O
Mol. Mass.:
489.757
SMILES:
Fc1ccccc1CNC(=O)Cn1nc(c(n1)-c1ccc(Cl)cc1Cl)-c1ccc(Cl)cc1
: