Target
Acetyl-CoA carboxylase
Ligand
BDBM50189617
Substrate
Meas. Tech.
ChEMBL_519005 (CHEMBL942566)
IC50
55±n/a nM
Citation
 Shinde, PSrivastava, SKOdedara, RTuli, DMunshi, SPatel, JZambad, SPSonawane, RGupta, RCChauthaiwale, VDutt, C Synthesis of spiro[chroman-2,4'-piperidin]-4-one derivatives as acetyl-CoA carboxylase inhibitors. Bioorg Med Chem Lett 19:949-53 (2009)  
Target
Name:
Acetyl-CoA carboxylase
Synonyms:
Acetyl-CoA carboxylase 2 (ACC2) | Acetyl-Coenzyme A carboxylase 2
Type:
Protein
Mol. Mass.:
276278.59
Organism:
Rattus norvegicus (Rat)
Description:
Residue:
2455
  
Inhibitor
Name:
BDBM50189617
Synonyms:
(3R)-1'-(9-anthrylcarbonyl)-3-(morpholin-4-ylcarbonyl)-1,4'-bipiperidine CHEMBL208943 | {(3R)-1'-(anthracen-9-ylcarbonyl)[1,4'-bipiperidin]-3-yl}(morpholin-4-yl)methanone
Type:
Small organic molecule
Emp. Form.:
C30H35N3O3
Mol. Mass.:
485.6172
SMILES:
O=C([C@@H]1CCCN(C1)C1CCN(CC1)C(=O)c1c2ccccc2cc2ccccc12)N1CCOCC1
: