Target
Prostaglandin G/H synthase 1
Ligand
BDBM50247578
Substrate
Meas. Tech.
ChEMBL_495250 (CHEMBL1003656)
IC50
20±n/a nM
Citation
 Scholz, MUlbrich, HKSoehnlein, OLindbom, LMattern, ADannhardt, G Diaryl-dithiolanes and -isothiazoles: COX-1/COX-2 and 5-LOX-inhibitory, *OH scavenging and anti-adhesive activities. Bioorg Med Chem 17:558-68 (2009)  
Target
Name:
Prostaglandin G/H synthase 1
Synonyms:
COX-1 Cyclooxygenase PGH1_BOVIN | PTGS1
Type:
PROTEIN
Mol. Mass.:
68814.10
Organism:
Bos taurus
Description:
ChEMBL_547440
Residue:
600
  
Inhibitor
Name:
BDBM50247578
Synonyms:
4-(4-Chlorophenyl)-5-p-tolyl-3H-1,2-dithiol-3-one | CHEMBL504541
Type:
Small organic molecule
Emp. Form.:
C16H11ClOS2
Mol. Mass.:
318.841
SMILES:
Cc1ccc(cc1)-c1ssc(=O)c1-c1ccc(Cl)cc1
: