Target
Delta-type opioid receptor
Ligand
BDBM50276446
Substrate
Meas. Tech.
ChEMBL_540961 (CHEMBL1030681)
IC50
1955±n/a nM
Citation
 Dockendorff, CJin, SOlsen, MLautens, MCoupal, MHodzic, LSpear, NPayza, KWalpole, CTomaszewski, MJ Discovery of mu-opioid selective ligands derived from 1-aminotetralin scaffolds made via metal-catalyzed ring-opening reactions. Bioorg Med Chem Lett 19:1228-32 (2009)  
Target
Name:
Delta-type opioid receptor
Synonyms:
D-OR-1 Delta opioid receptor OPIATE Delta OPRD1 OPRK1 | opioid receptor, delta 1
Type:
G Protein-Coupled Receptor (GPCR)
Mol. Mass.:
40382.98
Organism:
Homo sapiens (Human)
Description:
Competition binding assays were carried out using membrane preparations from transfected HN9.10 cells that constitutively expressed the delta opioid receptor.
Residue:
372
  
Inhibitor
Name:
BDBM50276446
Synonyms:
(+/-)-2-(4-chlorophenyl)-N-(2-methoxyethyl)-N-(2-(4-phenylpiperazin-1-yl)-1,2-dihydronaphthalen-1-yl)acetamide | CHEMBL459784
Type:
Small organic molecule
Emp. Form.:
C31H34ClN3O2
Mol. Mass.:
516.074
SMILES:
COCCN(C1C(C=Cc2ccccc12)N1CCN(CC1)c1ccccc1)C(=O)Cc1ccc(Cl)cc1
: