Target
Kappa-type opioid receptor
Ligand
BDBM50276446
Substrate
Meas. Tech.
ChEMBL_540960 (CHEMBL1030680)
IC50
7993±n/a nM
Citation
 Dockendorff, CJin, SOlsen, MLautens, MCoupal, MHodzic, LSpear, NPayza, KWalpole, CTomaszewski, MJ Discovery of mu-opioid selective ligands derived from 1-aminotetralin scaffolds made via metal-catalyzed ring-opening reactions. Bioorg Med Chem Lett 19:1228-32 (2009)  
Target
Name:
Kappa-type opioid receptor
Synonyms:
K-OR-1 Kappa-opioid receptor (KOR) Kappa-type opioid receptor (KOR) OPIATE Kappa OPRK1 kappa opioid receptor (KOR)
Type:
G Protein-Coupled Receptor (GPCR)
Mol. Mass.:
42648.76
Organism:
Homo sapiens (Human)
Description:
P41145
Residue:
380
  
Inhibitor
Name:
BDBM50276446
Synonyms:
(+/-)-2-(4-chlorophenyl)-N-(2-methoxyethyl)-N-(2-(4-phenylpiperazin-1-yl)-1,2-dihydronaphthalen-1-yl)acetamide | CHEMBL459784
Type:
Small organic molecule
Emp. Form.:
C31H34ClN3O2
Mol. Mass.:
516.074
SMILES:
COCCN(C1C(C=Cc2ccccc12)N1CCN(CC1)c1ccccc1)C(=O)Cc1ccc(Cl)cc1
: