Target
Vascular endothelial growth factor receptor 2
Ligand
BDBM50247962
Substrate
Meas. Tech.
ChEMBL_566632 (CHEMBL960946)
IC50
8±n/a nM
Citation
 Raeppel, SClaridge, SSaavedra, OGaudette, FZhan, LMannion, MZhou, NRaeppel, FGranger, MCIsakovic, LDéziel, RNguyen, HBeaulieu, NBeaulieu, CDupont, IRobert, MFLefebvre, SDubay, MRahil, JWang, JSte-Croix, HRobert Macleod, ABesterman, JVaisburg, A N-(3-fluoro-4-(2-arylthieno[3,2-b]pyridin-7-yloxy)phenyl)-2-oxo-3-phenylimidazolidine-1-carboxamides: a novel series of dual c-Met/VEGFR2 receptor tyrosine kinase inhibitors. Bioorg Med Chem Lett 19:1323-8 (2009)  
Target
Name:
Vascular endothelial growth factor receptor 2
Synonyms:
CD_antigen=CD309 Fetal liver kinase 1 (FLK-1) KDR Protein-tyrosine kinase receptor Flk-1 VEGFR-2 VEGFR2 Vascular Endothelial Growth Factor Receptor Kinase 2 Vascular endothelial growth factor receptor 2 (KDR) Vascular endothelial growth factor receptor 2 (VEGFR2) Vascular endothelial growth factor receptor-2 (VEGFR-2)
Type:
Receptor Tyrosine Kinase
Mol. Mass.:
151510.97
Organism:
Homo sapiens (Human)
Description:
P35968
Residue:
1356
  
Inhibitor
Name:
BDBM50247962
Synonyms:
CHEMBL462232 | N-(3-fluoro-4-(2-(1-methyl-1H-imidazol-4-yl)thieno[3,2-b]pyridin-7-yloxy)phenyl)-2-oxo-3-phenylimidazolidine-1-carboxamide
Type:
Small organic molecule
Emp. Form.:
C27H21FN6O3S
Mol. Mass.:
528.557
SMILES:
Cn1cnc(c1)-c1cc2nccc(Oc3ccc(NC(=O)N4CCN(C4=O)c4ccccc4)cc3F)c2s1
: