Target
Adenosine receptor A1
Ligand
BDBM50242664
Substrate
Meas. Tech.
ChEMBL_542424 (CHEMBL1010661)
Ki
28±n/a nM
Citation
 Giorgi, ILeonardi, MPietra, DBiagi, GBorghini, AMassarelli, ICiampi, OBianucci, AM Synthesis, biological assays and QSAR studies of N-(9-benzyl-2-phenyl-8-azapurin-6-yl)-amides as ligands for A1 adenosine receptors. Bioorg Med Chem 17:1817-30 (2009)  
Target
Name:
Adenosine receptor A1
Synonyms:
AA1R_RAT ADENOSINE A1 high Adenosine A1 receptor (A1) Adenosine receptors A1 | Adora1
Type:
Protein
Mol. Mass.:
36704.13
Organism:
Rattus norvegicus (rat)
Description:
Residue:
326
  
Inhibitor
Name:
BDBM50242664
Synonyms:
CHEMBL455383 | N-(3-benzyl-5-phenyl-3H-[1,2,3]triazolo[4,5-d]pyrimidin-7-yl)-4-methoxybenzamide
Type:
Small organic molecule
Emp. Form.:
C25H20N6O2
Mol. Mass.:
436.4653
SMILES:
COc1ccc(cc1)C(=O)Nc1nc(nc2n(Cc3ccccc3)nnc12)-c1ccccc1
: