Target
Cannabinoid receptor 2
Ligand
BDBM50258007
Substrate
Meas. Tech.
ChEMBL_567044 (CHEMBL1029952)
Ki
>10000±n/a nM
Citation
 Zindell, RRiether, DBosanac, TBerry, AGemkow, MJEbneth, ALöbbe, SRaymond, ELThome, DShih, DTThomson, D Morpholine containing CB2 selective agonists. Bioorg Med Chem Lett 19:1604-9 (2009)  
Target
Name:
Cannabinoid receptor 2
Synonyms:
CANNABINOID CB2 CB2 CB2B CNR2_HUMAN Cannabinoid CB2 receptor Cannabinoid receptor 2 (CB2R) | hCB2
Type:
G Protein-Coupled Receptor (GPCR)
Mol. Mass.:
39690.94
Organism:
Homo sapiens (Human)
Description:
P34972
Residue:
360
  
Inhibitor
Name:
BDBM50258007
Synonyms:
(S)-N-(2,4-dichlorophenyl)-5-((2-phenylmorpholino)methyl)pyridin-2-amine | CHEMBL492373
Type:
Small organic molecule
Emp. Form.:
C22H21Cl2N3O
Mol. Mass.:
414.328
SMILES:
Clc1ccc(Nc2ccc(CN3CCO[C@H](C3)c3ccccc3)cn2)c(Cl)c1
: