Target
5-hydroxytryptamine receptor 2B
Ligand
BDBM50257609
Substrate
Meas. Tech.
ChEMBL_567051 (CHEMBL1029959)
EC50
197±n/a nM
Citation
 Fish, PVBrown, ADEvrard, ERoberts, LR 7-Sulfonamido-3-benzazepines as potent and selective 5-HT2C receptor agonists: hit-to-lead optimization. Bioorg Med Chem Lett 19:1871-5 (2009)  
Target
Name:
5-hydroxytryptamine receptor 2B
Synonyms:
5-HT-2B 5-hydroxytryptamine (serotonin) receptor 2B [Homo sapiens] 5-hydroxytryptamine receptor 2C (5HT2C) HTR2B Serotonin 2b (5-HT2b) receptor | Serotonin Receptor 2B
Type:
G Protein-Coupled Receptor (GPCR)
Mol. Mass.:
54312.47
Organism:
Homo sapiens (Human)
Description:
Receptor binding assays were performed using human clone stably expressed in CHO cells.
Residue:
481
  
Inhibitor
Name:
BDBM50257609
Synonyms:
CHEMBL493151 | N-propyl-2,3,4,5-tetrahydro-1H-benzo[d]azepine-7-sulfonamide
Type:
Small organic molecule
Emp. Form.:
C13H20N2O2S
Mol. Mass.:
268.375
SMILES:
CCCNS(=O)(=O)c1ccc2CCNCCc2c1
: