Target
5-hydroxytryptamine receptor 2C
Ligand
BDBM50257609
Substrate
Meas. Tech.
ChEMBL_566811 (CHEMBL957620)
EC50
959±n/a nM
Citation
 Fish, PVBrown, ADEvrard, ERoberts, LR 7-Sulfonamido-3-benzazepines as potent and selective 5-HT2C receptor agonists: hit-to-lead optimization. Bioorg Med Chem Lett 19:1871-5 (2009)  
Target
Name:
5-hydroxytryptamine receptor 2C
Synonyms:
5-HT-1C 5-HT1C 5-HT2C-INI 5-HTR2C 5-hydroxytryptamine receptor 2C (5-HT-2C) 5HT-1C HTR1C Serotonin (5-HT3) receptor Serotonin Receptor 2C
Type:
G Protein-Coupled Receptor (GPCR)
Mol. Mass.:
51836.79
Organism:
Homo sapiens (Human)
Description:
P28335
Residue:
458
  
Inhibitor
Name:
BDBM50257609
Synonyms:
CHEMBL493151 | N-propyl-2,3,4,5-tetrahydro-1H-benzo[d]azepine-7-sulfonamide
Type:
Small organic molecule
Emp. Form.:
C13H20N2O2S
Mol. Mass.:
268.375
SMILES:
CCCNS(=O)(=O)c1ccc2CCNCCc2c1
: