Target
Hepatocyte growth factor receptor
Ligand
BDBM50257584
Substrate
Meas. Tech.
ChEMBL_567069 (CHEMBL1030748)
IC50
>10000±n/a nM
Citation
 Koolman, HHeinrich, TBöttcher, HRautenberg, WReggelin, M Syntheses of novel 2,3-diaryl-substituted 5-cyano-4-azaindoles exhibiting c-Met inhibition activity. Bioorg Med Chem Lett 19:1879-82 (2009)  
Target
Name:
Hepatocyte growth factor receptor
Synonyms:
Hepatocyte growth factor receptor Hepatocyte growth factor receptor (c-MET) MET Met proto-oncogene (hepatocyte growth factor receptor) Tyrosine-protein kinase Met (c-Met) c-Met kinase
Type:
Protein
Mol. Mass.:
155559.73
Organism:
Homo sapiens (Human)
Description:
P08581
Residue:
1390
  
Inhibitor
Name:
BDBM50257584
Synonyms:
2-(2-aminopyrimidin-5-yl)-3-(3-chloro-4-fluorophenyl)-1H-pyrrolo[3,2-b]pyridine-5-carbonitrile | CHEMBL492706
Type:
Small organic molecule
Emp. Form.:
C18H10ClFN6
Mol. Mass.:
364.764
SMILES:
Nc1ncc(cn1)-c1[nH]c2ccc(nc2c1-c1ccc(F)c(Cl)c1)C#N
: