Target
5-hydroxytryptamine receptor 2B
Ligand
BDBM50257395
Substrate
Meas. Tech.
ChEMBL_566858 (CHEMBL957592)
EC50
77±n/a nM
Citation
 Cho, SJJensen, NHKurome, TKadari, SManzano, MLMalberg, JECaldarone, BRoth, BLKozikowski, AP Selective 5-hydroxytryptamine 2C receptor agonists derived from the lead compound tranylcypromine: identification of drugs with antidepressant-like action. J Med Chem 52:1885-902 (2009)  
Target
Name:
5-hydroxytryptamine receptor 2B
Synonyms:
5-HT-2B 5-hydroxytryptamine (serotonin) receptor 2B [Homo sapiens] 5-hydroxytryptamine receptor 2C (5HT2C) HTR2B Serotonin 2b (5-HT2b) receptor | Serotonin Receptor 2B
Type:
G Protein-Coupled Receptor (GPCR)
Mol. Mass.:
54312.47
Organism:
Homo sapiens (Human)
Description:
Receptor binding assays were performed using human clone stably expressed in CHO cells.
Residue:
481
  
Inhibitor
Name:
BDBM50257395
Synonyms:
CHEMBL490064 | trans-[2-(3-Trifluoromethylphenyl)cyclopropyl]methylamine Hydrochloride
Type:
Small organic molecule
Emp. Form.:
C11H12F3N
Mol. Mass.:
215.2149
SMILES:
NC[C@H]1C[C@@H]1c1cccc(c1)C(F)(F)F
: