Target
5-hydroxytryptamine receptor 2A
Ligand
BDBM50257395
Substrate
Meas. Tech.
ChEMBL_566857 (CHEMBL957591)
EC50
1485±n/a nM
Citation
 Cho, SJJensen, NHKurome, TKadari, SManzano, MLMalberg, JECaldarone, BRoth, BLKozikowski, AP Selective 5-hydroxytryptamine 2C receptor agonists derived from the lead compound tranylcypromine: identification of drugs with antidepressant-like action. J Med Chem 52:1885-902 (2009)  
Target
Name:
5-hydroxytryptamine receptor 2A
Synonyms:
5-HT-2 5-HT2A 5-hydroxytryptamine receptor 2A (5HT-2A) 5HT2A_HUMAN HTR2A | Serotonin receptor 2A
Type:
undefined
Mol. Mass.:
52607.65
Organism:
Homo sapiens (Human)
Description:
P28223
Residue:
471
  
Inhibitor
Name:
BDBM50257395
Synonyms:
CHEMBL490064 | trans-[2-(3-Trifluoromethylphenyl)cyclopropyl]methylamine Hydrochloride
Type:
Small organic molecule
Emp. Form.:
C11H12F3N
Mol. Mass.:
215.2149
SMILES:
NC[C@H]1C[C@@H]1c1cccc(c1)C(F)(F)F
: