Target
5-hydroxytryptamine receptor 2C
Ligand
BDBM50257395
Substrate
Meas. Tech.
ChEMBL_566860 (CHEMBL957594)
EC50
30±n/a nM
Citation
 Cho, SJJensen, NHKurome, TKadari, SManzano, MLMalberg, JECaldarone, BRoth, BLKozikowski, AP Selective 5-hydroxytryptamine 2C receptor agonists derived from the lead compound tranylcypromine: identification of drugs with antidepressant-like action. J Med Chem 52:1885-902 (2009)  
Target
Name:
5-hydroxytryptamine receptor 2C
Synonyms:
5-HT-1C 5-HT1C 5-HT2C-INI 5-HTR2C 5-hydroxytryptamine receptor 2C (5-HT-2C) 5HT-1C HTR1C Serotonin (5-HT3) receptor Serotonin Receptor 2C
Type:
G Protein-Coupled Receptor (GPCR)
Mol. Mass.:
51836.79
Organism:
Homo sapiens (Human)
Description:
P28335
Residue:
458
  
Inhibitor
Name:
BDBM50257395
Synonyms:
CHEMBL490064 | trans-[2-(3-Trifluoromethylphenyl)cyclopropyl]methylamine Hydrochloride
Type:
Small organic molecule
Emp. Form.:
C11H12F3N
Mol. Mass.:
215.2149
SMILES:
NC[C@H]1C[C@@H]1c1cccc(c1)C(F)(F)F
: