Target
Metabotropic glutamate receptor 1
Ligand
BDBM50278286
Substrate
Meas. Tech.
ChEMBL_501594 (CHEMBL987723)
Ki
5±n/a nM
Citation
 Mantell, SJGibson, KROsborne, SAMaw, GNRees, HDodd, PGGreener, BHarbottle, GWMillion, WAPoinsard, CEngland, SCarnell, PBetts, AMMonhemius, RPrime, RL In vitro and in vivo SAR of pyrido[3,4-d]pyramid-4-ylamine based mGluR1 antagonists. Bioorg Med Chem Lett 19:2190-4 (2009)  
Target
Name:
Metabotropic glutamate receptor 1
Synonyms:
GRM1_RAT Grm1 Metabotropic glutamate receptor Mglur1 metabotropic glutamate 1/5-D metabotropic glutamate receptor 1 isoform alpha precursor
Type:
Enzyme Catalytic Domain
Mol. Mass.:
133240.47
Organism:
RAT
Description:
metabotropic glutamate 1/2 0 RAT::P23385
Residue:
1199
  
Inhibitor
Name:
BDBM50278286
Synonyms:
CHEMBL511266 | N4-(2,3-dihydro-1H-inden-2-yl)-N6-(2-methoxyethyl)pyrido[3,4-d]pyrimidine-4,6-diamine
Type:
Small organic molecule
Emp. Form.:
C19H21N5O
Mol. Mass.:
335.4029
SMILES:
COCCNc1cc2c(NC3Cc4ccccc4C3)ncnc2cn1
: