Target
Metabotropic glutamate receptor 1
Ligand
BDBM50278407
Substrate
Meas. Tech.
ChEMBL_501594 (CHEMBL987723)
Ki
6±n/a nM
Citation
 Mantell, SJGibson, KROsborne, SAMaw, GNRees, HDodd, PGGreener, BHarbottle, GWMillion, WAPoinsard, CEngland, SCarnell, PBetts, AMMonhemius, RPrime, RL In vitro and in vivo SAR of pyrido[3,4-d]pyramid-4-ylamine based mGluR1 antagonists. Bioorg Med Chem Lett 19:2190-4 (2009)  
Target
Name:
Metabotropic glutamate receptor 1
Synonyms:
GRM1_RAT Grm1 Metabotropic glutamate receptor Mglur1 metabotropic glutamate 1/5-D metabotropic glutamate receptor 1 isoform alpha precursor
Type:
Enzyme Catalytic Domain
Mol. Mass.:
133240.47
Organism:
RAT
Description:
metabotropic glutamate 1/2 0 RAT::P23385
Residue:
1199
  
Inhibitor
Name:
BDBM50278407
Synonyms:
CHEMBL470396 | N-cycloheptyl-6-(2-morpholinoethoxy)pyrido[3,4-d]pyrimidin-4-amine
Type:
Small organic molecule
Emp. Form.:
C20H29N5O2
Mol. Mass.:
371.4766
SMILES:
C(CN1CCOCC1)Oc1cc2c(NC3CCCCCC3)ncnc2cn1
: