Target
Phospholipase D1
Ligand
BDBM87185
Substrate
Meas. Tech.
ChEMBL_497566 (CHEMBL998623)
IC50
5900±n/a nM
Citation
 Lavieri, RScott, SALewis, JASelvy, PEArmstrong, MDAlex Brown, HLindsley, CW Design and synthesis of isoform-selective phospholipase D (PLD) inhibitors. Part II. Identification of the 1,3,8-triazaspiro[4,5]decan-4-one privileged structure that engenders PLD2 selectivity. Bioorg Med Chem Lett 19:2240-3 (2009)  
Target
Name:
Phospholipase D1
Synonyms:
Choline phosphatase 1 PLD1 Phosphatidylcholine-hydrolyzing phospholipase D1 Phospholipase D1 Phospholipase D2 (PLD2) | hPLD1
Type:
Protein
Mol. Mass.:
124219.92
Organism:
Homo sapiens (Human)
Description:
Q13393
Residue:
1074
  
Inhibitor
Name:
BDBM87185
Synonyms:
4-amino-3-methoxy-N-[2-(4-oxo-1-phenyl-1,3,8-triazaspiro[4.5]decan-8-yl)ethyl]benzamide;2,2,2-trifluoroacetic acid 4-azanyl-3-methoxy-N-[2-(4-oxidanylidene-1-phenyl-1,3,8-triazaspiro[4.5]decan-8-yl)ethyl]benzamide;2,2,2-tris(fluoranyl)ethanoic acid VU0364185-1 | cid_53470115
Type:
Small organic molecule
Emp. Form.:
C23H29N5O3
Mol. Mass.:
423.5081
SMILES:
COc1cc(ccc1N)C(=O)NCCN1CCC2(CC1)N(CNC2=O)c1ccccc1
: