Target
Cannabinoid receptor 1
Ligand
BDBM50267820
Substrate
Meas. Tech.
ChEMBL_563053 (CHEMBL1011883)
EC50
6±n/a nM
Citation
 Vachal, PFletcher, JMFong, TMHuang, CCLao, JXiao, JCShen, CPStrack, AMShearman, LStribling, SChen, RZFrassetto, ATong, XWang, JBall, RGTsou, NNHickey, GJThompson, DFFaidley, TDNicolich, SAchanfuo-Yeboah, JHora, DFHale, JJHagmann, WK 1-Sulfonyl-4-acylpiperazines as selective cannabinoid-1 receptor (CB1R) inverse agonists for the treatment of obesity. J Med Chem 52:2550-8 (2009)  
Target
Name:
Cannabinoid receptor 1
Synonyms:
CANN6 CB-R CNR CNR1_HUMAN Cannabinoid receptor Cannabinoid receptor 1 (brain)
Type:
G Protein-Coupled Receptor (GPCR)
Mol. Mass.:
52868.96
Organism:
Homo sapiens (Human)
Description:
P21554
Residue:
472
  
Inhibitor
Name:
BDBM50267820
Synonyms:
(4-(biphenyl-3-ylsulfonyl)piperazin-1-yl)(cyclohexyl)methanone | CHEMBL490043
Type:
Small organic molecule
Emp. Form.:
C23H28N2O3S
Mol. Mass.:
412.545
SMILES:
O=C(C1CCCCC1)N1CCN(CC1)S(=O)(=O)c1cccc(c1)-c1ccccc1
: