Target
Cytochrome P450 3A4
Ligand
BDBM50267295
Substrate
Meas. Tech.
ChEMBL_563303 (CHEMBL981939)
Ki
66±n/a nM
Citation
 Degoey, DAGrampovnik, DJFlentge, CAFlosi, WJChen, HJYeung, CMRandolph, JTKlein, LLDekhtyar, TColletti, LMarsh, KCStoll, VMamo, MMorfitt, DCNguyen, BSchmidt, JMSwanson, SJMo, HKati, WMMolla, AKempf, DJ 2-Pyridyl P1'-substituted symmetry-based human immunodeficiency virus protease inhibitors (A-792611 and A-790742) with potential for convenient dosing and reduced side effects. J Med Chem 52:2571-86 (2009)  
Target
Name:
Cytochrome P450 3A4
Synonyms:
Albendazole monooxygenase CP3A4_HUMAN CYP3A4 CYPIIIA4 Cytochrome P450 3A4 (CYP3A4) Nifedipine oxidase Taurochenodeoxycholate 6-alpha-hydroxylase
Type:
Enzyme
Mol. Mass.:
57349.57
Organism:
Homo sapiens (Human)
Description:
Residue:
503
  
Inhibitor
Name:
BDBM50267295
Synonyms:
CHEMBL470508 | Methyl (S)-1-((2R,4S,5S)-4-Hydroxy-5-((S)-2-(3-((6-(2-hydroxypropan-2-yl)pyridin-2-yl)methyl)-2-oxoimidazolidin-1-yl)-3,3-dimethylbutanamido)-6-phenyl-1-(4-(pyridin-2-yl)phenyl)hexan-2-ylamino)-3,3-dimethyl-1-oxobutan-2-ylcarbamate
Type:
Small organic molecule
Emp. Form.:
C49H65N7O7
Mol. Mass.:
864.0831
SMILES:
COC(=O)N[C@H](C(=O)N[C@@H](C[C@H](O)[C@H](Cc1ccccc1)NC(=O)[C@@H](N1CCN(Cc2cccc(n2)C(C)(C)O)C1=O)C(C)(C)C)Cc1ccc(cc1)-c1ccccn1)C(C)(C)C
: