Target
D(2) dopamine receptor
Ligand
BDBM50095027
Substrate
Meas. Tech.
ChEMBL_563485 (CHEMBL961033)
Ki
2250±n/a nM
Citation
 Herth, MMKramer, VPiel, MPalner, MRiss, PJKnudsen, GMRösch, F Synthesis and in vitro affinities of various MDL 100907 derivatives as potential 18F-radioligands for 5-HT2A receptor imaging with PET. Bioorg Med Chem 17:2989-3002 (2009)  
Target
Name:
D(2) dopamine receptor
Synonyms:
D(2) dopamine receptor DOPAMINE D2 Long DRD2 Dopamine D2 receptor Dopamine D2 receptor (D2R) Dopamine2-like | d2
Type:
Cell-surface receptors
Mol. Mass.:
50647.10
Organism:
Homo sapiens (Human)
Description:
P14416
Residue:
443
  
Inhibitor
Name:
BDBM50095027
Synonyms:
(2,3-Dimethoxy-phenyl)-{1-[2-(4-fluoro-phenyl)-ethyl]-piperidin-4-yl}-methanol (2,3-Dimethoxy-phenyl)-{1-[2-(4-fluoro-phenyl)-ethyl]-piperidin-4-yl}-methanol(MDL 100907) (R)-(2,3-Dimethoxy-phenyl)-{1-[2-(4-fluoro-phenyl)-ethyl]-piperidin-4-yl}-methanol (R)-(2,3-dimethoxyphenyl)(1-(4-fluorophenethyl)piperidin-4-yl)methanol MDL 100907 | MDL-100907
Type:
Small organic molecule
Emp. Form.:
C22H28FNO3
Mol. Mass.:
373.461
SMILES:
COc1cccc([C@H](O)C2CCN(CCc3ccc(F)cc3)CC2)c1OC
: