Target
DNA topoisomerase 2-alpha
Ligand
BDBM50227946
Substrate
Meas. Tech.
ChEMBL_499143 (CHEMBL1011417)
IC50
12270±n/a nM
Citation
 Loza-Mejía, MAOlvera-Vázquez, SMaldonado-Hernández, KGuadarrama-Salgado, TGonzález-Sánchez, IRodríguez-Hernández, FSolano, JDRodríguez-Sotres, RLira-Rocha, A Synthesis, cytotoxic activity, DNA topoisomerase-II inhibition, molecular modeling and structure-activity relationship of 9-anilinothiazolo[5,4-b]quinoline derivatives. Bioorg Med Chem 17:3266-77 (2009)  
Target
Name:
DNA topoisomerase 2-alpha
Synonyms:
DNA topoisomerase 2-alpha DNA topoisomerase II (Topo II) DNA topoisomerase II, alpha isozyme TOP2A Topoisomerase I/II | Topoisomerase II alpha (HuTopoIIα)
Type:
Protein
Mol. Mass.:
174415.30
Organism:
Homo sapiens (Human)
Description:
P11388
Residue:
1531
  
Inhibitor
Name:
BDBM50227946
Synonyms:
9-[[(3-N-methylamino)phenyl]amino]-2-(methylthio)-thiazolo[5,4-b]quinoline N1-methyl-N3-(2-(methylthio)thiazolo[5,4-b]quinolin-9-yl)benzene-1,3-diamine
Type:
Small organic molecule
Emp. Form.:
C18H16N4S2
Mol. Mass.:
352.476
SMILES:
CNc1cccc(Nc2c3nc(SC)sc3nc3ccccc23)c1
: