Target
Bile acid receptor
Ligand
BDBM50258556
Substrate
Meas. Tech.
ChEMBL_500794 (CHEMBL974375)
EC50
240±n/a nM
Citation
 Bass, JYCaldwell, RDCaravella, JAChen, LCreech, KLDeaton, DNMadauss, KPMarr, HBMcFadyen, RBMiller, ABParks, DJTodd, DWilliams, SPWisely, GB Substituted isoxazole analogs of farnesoid X receptor (FXR) agonist GW4064. Bioorg Med Chem Lett 19:2969-73 (2009)  
Target
Name:
Bile acid receptor
Synonyms:
BAR FXR HRR1 NR1H4_HUMAN RIP14 Retinoid X receptor-interacting protein 14 | farnesoid x receptor
Type:
Nuclear Receptor
Mol. Mass.:
55916.24
Organism:
Homo sapiens (Human)
Description:
Q96RI1
Residue:
486
  
Inhibitor
Name:
BDBM50258556
Synonyms:
3-(2-chloro-4-((5-cyclopentyl-3-(2,6-dichlorophenyl)isoxazol-4-yl)methoxy)styryl)benzoic acid | CHEMBL466867
Type:
Small organic molecule
Emp. Form.:
C30H24Cl3NO4
Mol. Mass.:
568.875
SMILES:
OC(=O)c1cccc(\C=C\c2ccc(OCc3c(noc3C3CCCC3)-c3c(Cl)cccc3Cl)cc2Cl)c1
: