Target
Extracellular calcium-sensing receptor
Ligand
BDBM50268076
Substrate
Meas. Tech.
ChEMBL_520033 (CHEMBL939872)
IC50
300±n/a nM
Citation
 Marquis, RWLago, AMCallahan, JFTrout, REGowen, MDelMar, EGVan Wagenen, BCLogan, SShimizu, SFox, JNemeth, EFYang, ZRoethke, TSmith, BRWard, KWLee, JKeenan, RMBhatnagar, P Antagonists of the calcium receptor I. Amino alcohol-based parathyroid hormone secretagogues. J Med Chem 52:3982-93 (2009)  
Target
Name:
Extracellular calcium-sensing receptor
Synonyms:
CASR CaR Calcium-sensing receptor (CaSR) GPRC2A Parathyroid Cell calcium-sensing receptor Synonyms=GPRC2A | hCasR
Type:
Protein
Mol. Mass.:
120663.13
Organism:
Homo sapiens (Human)
Description:
P41180
Residue:
1078
  
Inhibitor
Name:
BDBM50268076
Synonyms:
(2S)-1-[(2,3-Dichlorophenyl)oxy]-3-((1,1-dimethyl-2-[4-(methyloxy)phenyl]ethyl)amino)-2-propanol | CHEMBL487508
Type:
Small organic molecule
Emp. Form.:
C20H25Cl2NO3
Mol. Mass.:
398.323
SMILES:
COc1ccc(CC(C)(C)NC[C@H](O)COc2cccc(Cl)c2Cl)cc1
: