Target
Prostaglandin G/H synthase 1/2
Ligand
BDBM50280051
Substrate
Meas. Tech.
ChEMBL_51498 (CHEMBL665833)
IC50
190±n/a nM
Citation
 Boschelli, DHConnor, DTHoefle, MBornemeier, DADyer, RD Conversion of NSAIDS into balanced dual inhibitors of cyclooxygenase and 5-lipoxygenase Bioorg Med Chem Lett 2:69-72 (1992)    Article 
Target
Name:
Prostaglandin G/H synthase 1/2
Synonyms:
Cyclooxygenase
Type:
Mol. Mass.:
Description:
ASSAY_ID of ChEMBL is 1666355
Components:
This complex has 2 components.
Component 1
Name:
Prostaglandin G/H synthase 2
Synonyms:
Cox-2 Cyclooxygenase Ptgs2
Type:
Enzyme Catalytic Domain
Mol. Mass.:
69173.51
Organism:
RAT
Description:
COX-2 0 RAT::P35355
Residue:
604
  
Component 2
Name:
Prostaglandin G/H synthase 1
Synonyms:
Cox-1 Cyclooxygenase PGH1_RAT Ptgs1
Type:
Enzyme Catalytic Domain
Mol. Mass.:
69033.56
Organism:
RAT
Description:
COX-1 0 RAT::Q63921
Residue:
602
  
Inhibitor
Name:
BDBM50280051
Synonyms:
5-[2-(3-Trifluoromethyl-phenylamino)-pyridin-3-yl]-3H-[1,3,4]oxadiazole-2-thione | CHEMBL350729
Type:
Small organic molecule
Emp. Form.:
C14H9F3N4OS
Mol. Mass.:
338.308
SMILES:
FC(F)(F)c1cccc(Nc2ncccc2-c2nnc(S)o2)c1
: