Target
Myosin light chain kinase, smooth muscle
Ligand
BDBM50280871
Substrate
Meas. Tech.
ChEBML_161608
IC50
450±n/a nM
Citation
 Kleinschroth, JHartenstein, JRudolph, CSchächtele, C Non-glycosidic/non-aminoalkyl-substituted indolocarbazoles as inhibitors of protein kinase C Bioorg Med Chem Lett 3:1959-1964 (1993)    Article 
Target
Name:
Myosin light chain kinase, smooth muscle
Synonyms:
MLCK Mylk Telokin
Type:
Enzyme
Mol. Mass.:
210423.57
Organism:
Gallus gallus (chicken)
Description:
Residue:
1906
  
Inhibitor
Name:
BDBM50280871
Synonyms:
12-(3-azidopropyl)-13-methyl-6,7,12,13-tetrahydro-5H-indolo[2,3-a]pyrrolo[3,4-c]carbazol-5-one | CHEMBL59385
Type:
Small organic molecule
Emp. Form.:
C24H20N6O
Mol. Mass.:
408.4552
SMILES:
Cn1c2ccccc2c2c3C(=O)NCc3c3c4ccccc4n(CCCN=[N+]=[N-])c3c12
: