Target
cAMP-dependent protein kinase catalytic subunit alpha
Ligand
BDBM50280873
Substrate
Meas. Tech.
ChEBML_161731
IC50
6300±n/a nM
Citation
 Kleinschroth, JHartenstein, JRudolph, CSchächtele, C Non-glycosidic/non-aminoalkyl-substituted indolocarbazoles as inhibitors of protein kinase C Bioorg Med Chem Lett 3:1959-1964 (1993)    Article 
Target
Name:
cAMP-dependent protein kinase catalytic subunit alpha
Synonyms:
KAPCA_BOVIN PKC Protein Kinase C cAMP-Dependent Protein Kinase (PKA) cAMP-dependent protein kinase A cAMP-dependent protein kinase, alpha-catalytic subunit
Type:
Enzyme Complex
Mol. Mass.:
40627.77
Organism:
Bos taurus (bovine)
Description:
The PKA holoenzyme purified from bovine heart, exists as an inactive tetrameric complex, which consists of a regulatory dimer associated with two catalytic subunits. It requires cAMP to activate the enzymatic reaction.
Residue:
351
  
Inhibitor
Name:
BDBM50280873
Synonyms:
2-(13-ethyl-5-oxo-6,7,12,13-tetrahydro-5H-indolo[2,3-a]pyrrolo[3,4-c]carbazol-12-yl)ethyl cyanide | CHEMBL58458
Type:
Small organic molecule
Emp. Form.:
C25H20N4O
Mol. Mass.:
392.4525
SMILES:
CCn1c2ccccc2c2c3C(=O)NCc3c3c4ccccc4n(CCC#N)c3c12
: