Target
cGMP-dependent protein kinase 1
Ligand
BDBM50280868
Substrate
Meas. Tech.
ChEBML_161596
IC50
280±n/a nM
Citation
 Kleinschroth, JHartenstein, JRudolph, CSchächtele, C Non-glycosidic/non-aminoalkyl-substituted indolocarbazoles as inhibitors of protein kinase C Bioorg Med Chem Lett 3:1959-1964 (1993)    Article 
Target
Name:
cGMP-dependent protein kinase 1
Synonyms:
CGK 1 alpha PRKG1 PRKGR1A cGMP-Dependent Protein Kinase cGMP-dependent protein kinase 1, alpha isozyme
Type:
Enzyme
Mol. Mass.:
76413.14
Organism:
Bos taurus (bovine)
Description:
Residue:
671
  
Inhibitor
Name:
BDBM50280868
Synonyms:
12-(2,3-dihydroxypropyl)-6,7,12,13-tetrahydro-5H-indolo[2,3-a]pyrrolo[3,4-c]carbazol-5-one | CHEMBL291920
Type:
Small organic molecule
Emp. Form.:
C23H19N3O3
Mol. Mass.:
385.4153
SMILES:
OCC(O)Cn1c2ccccc2c2c3CNC(=O)c3c3c4ccccc4[nH]c3c12
: