Target
cGMP-dependent protein kinase 1
Ligand
BDBM3033
Substrate
Meas. Tech.
ChEBML_161596
IC50
6200±n/a nM
Citation
 Kleinschroth, JHartenstein, JRudolph, CSchächtele, C Non-glycosidic/non-aminoalkyl-substituted indolocarbazoles as inhibitors of protein kinase C Bioorg Med Chem Lett 3:1959-1964 (1993)    Article 
Target
Name:
cGMP-dependent protein kinase 1
Synonyms:
CGK 1 alpha PRKG1 PRKGR1A cGMP-Dependent Protein Kinase cGMP-dependent protein kinase 1, alpha isozyme
Type:
Enzyme
Mol. Mass.:
76413.14
Organism:
Bos taurus (bovine)
Description:
Residue:
671
  
Inhibitor
Name:
BDBM3033
Synonyms:
3-{23-methyl-14-oxo-3,13,23-triazahexacyclo[14.7.0.0^{2,10}.0^{4,9}.0^{11,15}.0^{17,22}]tricosa-1(16),2(10),4(9),5,7,11(15),17,19,21-nonaen-3-yl}propanenitrile Go 6976 | Indolocarbazole deriv.
Type:
Small organic molecule
Emp. Form.:
C24H18N4O
Mol. Mass.:
378.4259
SMILES:
Cn1c2ccccc2c2c3C(=O)NCc3c3c4ccccc4n(CCC#N)c3c12
: