Target
Myosin light chain kinase, smooth muscle
Ligand
BDBM50280873
Substrate
Meas. Tech.
ChEBML_161608
IC50
1600±n/a nM
Citation
 Kleinschroth, JHartenstein, JRudolph, CSchächtele, C Non-glycosidic/non-aminoalkyl-substituted indolocarbazoles as inhibitors of protein kinase C Bioorg Med Chem Lett 3:1959-1964 (1993)    Article 
Target
Name:
Myosin light chain kinase, smooth muscle
Synonyms:
MLCK Mylk Telokin
Type:
Enzyme
Mol. Mass.:
210423.57
Organism:
Gallus gallus (chicken)
Description:
Residue:
1906
  
Inhibitor
Name:
BDBM50280873
Synonyms:
2-(13-ethyl-5-oxo-6,7,12,13-tetrahydro-5H-indolo[2,3-a]pyrrolo[3,4-c]carbazol-12-yl)ethyl cyanide | CHEMBL58458
Type:
Small organic molecule
Emp. Form.:
C25H20N4O
Mol. Mass.:
392.4525
SMILES:
CCn1c2ccccc2c2c3C(=O)NCc3c3c4ccccc4n(CCC#N)c3c12
: