Target
Type-1 angiotensin II receptor
Ligand
BDBM50280922
Substrate
Meas. Tech.
ChEBML_36936
IC50
8500±n/a nM
Citation
 Wu, MTIkeler, TJAshton, WTChang, RSLotti, VJGreenlee, WJ Synthesis and structure-activity relationships of a novel series of non-peptide AT2-selective angiotensin II receptor antagonists Bioorg Med Chem Lett 3:2023-2028 (1993)    Article 
Target
Name:
Type-1 angiotensin II receptor
Synonyms:
AGTR1 ANGIOTENSIN AT1 Angiotensin II type 1a (AT-1a) receptor
Type:
Enzyme Catalytic Domain
Mol. Mass.:
41009.15
Organism:
RABBIT
Description:
ANGIOTENSIN AT1 AGTR1 RABBIT::P34976
Residue:
359
  
Inhibitor
Name:
BDBM50280922
Synonyms:
4-Dipentylcarbamoyl-1-[(4-iodo-phenyl)-phenyl-carbamoyl]-piperazine-2-carboxylic acid | CHEMBL62744
Type:
Small organic molecule
Emp. Form.:
C29H39IN4O4
Mol. Mass.:
634.5488
SMILES:
CCCCCN(CCCCC)C(=O)N1CCN([C@@H](C1)C(O)=O)C(=O)N(c1ccccc1)c1ccc(I)cc1
: