Target
Polyunsaturated fatty acid 5-lipoxygenase
Ligand
BDBM50280964
Substrate
Meas. Tech.
ChEBML_86709
IC50
660±n/a nM
Citation
 Thérien, MFitzsimmons, BJScheigets, JMacdonald, DChoo, LYGuay, JFalgueyret, JPRiendeau, D Justicidin E: A new leukotriene biosynthesis inhibitor. Bioorg Med Chem Lett 3:2063-2066 (1993)    Article 
Target
Name:
Polyunsaturated fatty acid 5-lipoxygenase
Synonyms:
5-LO 5-Lipoxygenase (5-LO) 5-Lipoygenase ALOX5 LOG5 | LOX5_HUMAN
Type:
Enzyme
Mol. Mass.:
77972.74
Organism:
Homo sapiens (Human)
Description:
Recombinant protein was purified from E. coli lysate. After ammonium sulfate precipitation and subsequent steps, the supernatant (S100) was used for 5-LO activity assay.
Residue:
674
  
Inhibitor
Name:
BDBM50280964
Synonyms:
5-Benzo[1,3]dioxol-5-yl-furo[3',4':6,7]naphtho[2,3-d][1,3]dioxole-6,8-dione | CHEMBL304018
Type:
Small organic molecule
Emp. Form.:
C20H10O7
Mol. Mass.:
362.2892
SMILES:
O=C1OC(=O)c2c1cc1cc3OCOc3cc1c2-c1ccc2OCOc2c1
: