Target
Polyunsaturated fatty acid 5-lipoxygenase
Ligand
BDBM50280961
Substrate
Meas. Tech.
ChEMBL_3796 (CHEMBL619871)
IC50
500±n/a nM
Citation
 Thérien, MFitzsimmons, BJScheigets, JMacdonald, DChoo, LYGuay, JFalgueyret, JPRiendeau, D Justicidin E: A new leukotriene biosynthesis inhibitor. Bioorg Med Chem Lett 3:2063-2066 (1993)    Article 
Target
Name:
Polyunsaturated fatty acid 5-lipoxygenase
Synonyms:
5-LO 5-Lipoxygenase (5-LO) 5-Lipoygenase ALOX5 LOG5 | LOX5_HUMAN
Type:
Enzyme
Mol. Mass.:
77972.74
Organism:
Homo sapiens (Human)
Description:
Recombinant protein was purified from E. coli lysate. After ammonium sulfate precipitation and subsequent steps, the supernatant (S100) was used for 5-LO activity assay.
Residue:
674
  
Inhibitor
Name:
BDBM50280961
Synonyms:
9-Benzo[1,3]dioxol-5-yl-8H-furo[3',4':6,7]naphtho[2,3-d][1,3]dioxol-6-one Justicidin-E
Type:
Small organic molecule
Emp. Form.:
C20H12O6
Mol. Mass.:
348.3057
SMILES:
O=C1OCc2c1cc1cc3OCOc3cc1c2-c1ccc2OCOc2c1
: