Target
Polyunsaturated fatty acid 5-lipoxygenase
Ligand
BDBM50240576
Substrate
Meas. Tech.
ChEBML_86709
IC50
760±n/a nM
Citation
 Thérien, MFitzsimmons, BJScheigets, JMacdonald, DChoo, LYGuay, JFalgueyret, JPRiendeau, D Justicidin E: A new leukotriene biosynthesis inhibitor. Bioorg Med Chem Lett 3:2063-2066 (1993)    Article 
Target
Name:
Polyunsaturated fatty acid 5-lipoxygenase
Synonyms:
5-LO 5-Lipoxygenase (5-LO) 5-Lipoygenase ALOX5 LOG5 | LOX5_HUMAN
Type:
Enzyme
Mol. Mass.:
77972.74
Organism:
Homo sapiens (Human)
Description:
Recombinant protein was purified from E. coli lysate. After ammonium sulfate precipitation and subsequent steps, the supernatant (S100) was used for 5-LO activity assay.
Residue:
674
  
Inhibitor
Name:
BDBM50240576
Synonyms:
4-Benzo[1,3]dioxol-5-yl-6,7-dimethoxy-3H-naphtho[2,3-c]furan-1-one Retrojusticidin B
Type:
Small organic molecule
Emp. Form.:
C21H16O6
Mol. Mass.:
364.3481
SMILES:
COc1cc2cc3C(=O)OCc3c(-c3ccc4OCOc4c3)c2cc1OC
: