Target
Polyunsaturated fatty acid 5-lipoxygenase
Ligand
BDBM50280973
Substrate
Meas. Tech.
ChEBML_86709
IC50
1400±n/a nM
Citation
 Thérien, MFitzsimmons, BJScheigets, JMacdonald, DChoo, LYGuay, JFalgueyret, JPRiendeau, D Justicidin E: A new leukotriene biosynthesis inhibitor. Bioorg Med Chem Lett 3:2063-2066 (1993)    Article 
Target
Name:
Polyunsaturated fatty acid 5-lipoxygenase
Synonyms:
5-LO 5-Lipoxygenase (5-LO) 5-Lipoygenase ALOX5 LOG5 | LOX5_HUMAN
Type:
Enzyme
Mol. Mass.:
77972.74
Organism:
Homo sapiens (Human)
Description:
Recombinant protein was purified from E. coli lysate. After ammonium sulfate precipitation and subsequent steps, the supernatant (S100) was used for 5-LO activity assay.
Residue:
674
  
Inhibitor
Name:
BDBM50280973
Synonyms:
4-(4-Methoxy-phenyl)-3H-naphtho[2,3-c]furan-1-one | CHEMBL62286
Type:
Small organic molecule
Emp. Form.:
C19H14O3
Mol. Mass.:
290.3127
SMILES:
COc1ccc(cc1)-c1c2COC(=O)c2cc2ccccc12
: