Target
Polyunsaturated fatty acid 5-lipoxygenase
Ligand
BDBM50280977
Substrate
Meas. Tech.
ChEBML_86709
IC50
450±n/a nM
Citation
 Thérien, MFitzsimmons, BJScheigets, JMacdonald, DChoo, LYGuay, JFalgueyret, JPRiendeau, D Justicidin E: A new leukotriene biosynthesis inhibitor. Bioorg Med Chem Lett 3:2063-2066 (1993)    Article 
Target
Name:
Polyunsaturated fatty acid 5-lipoxygenase
Synonyms:
5-LO 5-Lipoxygenase (5-LO) 5-Lipoygenase ALOX5 LOG5 | LOX5_HUMAN
Type:
Enzyme
Mol. Mass.:
77972.74
Organism:
Homo sapiens (Human)
Description:
Recombinant protein was purified from E. coli lysate. After ammonium sulfate precipitation and subsequent steps, the supernatant (S100) was used for 5-LO activity assay.
Residue:
674
  
Inhibitor
Name:
BDBM50280977
Synonyms:
4-Phenyl-5H-6-oxa-1-thia-s-indacen-7-one | CHEMBL65329
Type:
Small organic molecule
Emp. Form.:
C16H10O2S
Mol. Mass.:
266.314
SMILES:
O=C1OCc2c1cc1sccc1c2-c1ccccc1
: