Target
Polyunsaturated fatty acid 5-lipoxygenase
Ligand
BDBM50280980
Substrate
Meas. Tech.
ChEBML_86709
IC50
4200±n/a nM
Citation
 Thérien, MFitzsimmons, BJScheigets, JMacdonald, DChoo, LYGuay, JFalgueyret, JPRiendeau, D Justicidin E: A new leukotriene biosynthesis inhibitor. Bioorg Med Chem Lett 3:2063-2066 (1993)    Article 
Target
Name:
Polyunsaturated fatty acid 5-lipoxygenase
Synonyms:
5-LO 5-Lipoxygenase (5-LO) 5-Lipoygenase ALOX5 LOG5 | LOX5_HUMAN
Type:
Enzyme
Mol. Mass.:
77972.74
Organism:
Homo sapiens (Human)
Description:
Recombinant protein was purified from E. coli lysate. After ammonium sulfate precipitation and subsequent steps, the supernatant (S100) was used for 5-LO activity assay.
Residue:
674
  
Inhibitor
Name:
BDBM50280980
Synonyms:
9-Benzo[1,3]dioxol-5-yl-7,8-dihydro-1,3-dioxa-7-aza-dicyclopenta[b,g]naphthalen-6-one | CHEMBL65510
Type:
Small organic molecule
Emp. Form.:
C20H13NO5
Mol. Mass.:
347.3209
SMILES:
O=C1NCc2c1cc1cc3OCOc3cc1c2-c1ccc2OCOc2c1
: