Target
Leukotriene B4 receptor 1
Ligand
BDBM81519
Substrate
Meas. Tech.
ChEMBL_98504 (CHEMBL709166)
Ki
78±n/a nM
Citation
 Sofia, MJFloreancig, PJackson, WTMarder, PSaussy, DLSilbaugh, SACockerham, SLFroelich, LLRoman, CRStengel, PWFleisch, JH Acid unit modifications of 1,2,4,5-substituted hydroxyacetophenones and the effect on in vitro and in vivo LTB4 receptor antagonism Bioorg Med Chem Lett 3:1147-1152 (1993)    Article 
Target
Name:
Leukotriene B4 receptor 1
Synonyms:
BLT BLTR Chemoattractant receptor-like 1 GPR16 LTB4-R 1 Leukotriene B4 R1 Leukotriene B4 receptor 1 P2Y purinoceptor 7 | P2Y7
Type:
Enzyme Catalytic Domain
Mol. Mass.:
37582.68
Organism:
Homo sapiens (Human)
Description:
Q15722
Residue:
352
  
Inhibitor
Name:
BDBM81519
Synonyms:
CAS_117690-79-6 CHEMBL15766 | LY 255283
Type:
Small organic molecule
Emp. Form.:
C19H28N4O3
Mol. Mass.:
360.4506
SMILES:
CCc1cc(C(C)=O)c(O)cc1OCCCCCC(C)(C)c1nnn[nH]1
: