Target
Type-1 angiotensin II receptor
Ligand
BDBM50009718
Substrate
Meas. Tech.
ChEMBL_34651 (CHEMBL649710)
IC50
0.800000±n/a nM
Citation
 Kevin, NJRivero, RAGreenlee, WJChang, RSChen, TB Subtituted phenylthiophene benzoylsulfonamides with potent binding affinity to angiotensin II AT1 and AT2 receptors Bioorg Med Chem Lett 4:189-194 (1994)    Article 
Target
Name:
Type-1 angiotensin II receptor
Synonyms:
AGTR1 ANGIOTENSIN AT1 Angiotensin II type 1a (AT-1a) receptor
Type:
Enzyme Catalytic Domain
Mol. Mass.:
41009.15
Organism:
RABBIT
Description:
ANGIOTENSIN AT1 AGTR1 RABBIT::P34976
Residue:
359
  
Inhibitor
Name:
BDBM50009718
Synonyms:
2-Ethyl-5,7-dimethyl-3-[2'-(1H-tetrazol-5-yl)-biphenyl-4-ylmethyl]-3H-imidazo[4,5-b]pyridine 2-Ethyl-5,7-dimethyl-3-[2'-(1H-tetrazol-5-yl)-biphenyl-4-ylmethyl]-3H-imidazo[4,5-b]pyridine (L158809) 2-Ethyl-5,7-dimethyl-3-[2'-(2H-tetrazol-5-yl)-biphenyl-4-ylmethyl]-3H-imidazo[4,5-b]pyridine(L-158809) CHEMBL7550 | L-158809
Type:
Small organic molecule
Emp. Form.:
C24H23N7
Mol. Mass.:
409.4863
SMILES:
CCc1nc2c(C)cc(C)nc2n1Cc1ccc(cc1)-c1ccccc1-c1nnn[nH]1
: