Target
Voltage-dependent L-type calcium channel subunit alpha-1C
Ligand
BDBM50283420
Substrate
Meas. Tech.
ChEMBL_42914 (CHEMBL654395)
EC50
61±n/a nM
Citation
 Kane, JMCarr, AACheng, HCDudley, MWRampe, DStaeger, MA Heterocyclic guanidines as calcium antagonists Bioorg Med Chem Lett 4:351-354 (1994)    Article 
Target
Name:
Voltage-dependent L-type calcium channel subunit alpha-1C
Synonyms:
CAC1C_RAT Cacn2 Cacnl1a1 Calcium channel (Type L) Calcium channel, L type, alpha-1 polypeptide, isoform 1, cardiac muscle RBC Voltage-dependent L-type calcium channel subunit alpha-1C Voltage-gated L-type calcium channel alpha-1C subunit | Voltage-gated calcium channel subunit alpha Cav1.2
Type:
Enzyme Catalytic Domain
Mol. Mass.:
243492.26
Organism:
RAT
Description:
Calcium channel 0 RAT::P22002
Residue:
2169
  
Inhibitor
Name:
BDBM50283420
Synonyms:
((E)-Azacyclotridec-1-en-2-yl)-((1S,2S)-2-phenyl-cyclopentyl)-amine | CHEMBL119336
Type:
Small organic molecule
Emp. Form.:
C23H36N2
Mol. Mass.:
340.5453
SMILES:
C1C[C@H](N=C2CCCCCCCCCCCN2)[C@@H](C1)c1ccccc1
: