Target
Stromelysin-1
Ligand
BDBM50283704
Substrate
Meas. Tech.
ChEBML_102088
Ki
6.3±n/a nM
Citation
 Porter, JRBeeley, NRBoyce, BAMason, BMillican, AMillar, KLeonard, JMorphy, JRO'Connell, JP Potent and selective inhibitors of gelatinase-a 1. hydroxamic acid derivatives Bioorg Med Chem Lett 4:2741-2746 (1994)    Article 
Target
Name:
Stromelysin-1
Synonyms:
MMP-3 MMP3_HUMAN Matrix metalloproteinase 3 Matrix metalloproteinase-3 (MMP-3) SL-1 Stromelysin 1 | Transin-1
Type:
Enzyme
Mol. Mass.:
53973.13
Organism:
Homo sapiens (Human)
Description:
P08254
Residue:
477
  
Inhibitor
Name:
BDBM50283704
Synonyms:
(R)-N*1*-[(S)-2-Cyclohexyl-1-(2-morpholin-4-yl-ethylcarbamoyl)-ethyl]-N*4*-hydroxy-2-(3-p-tolyl-propyl)-succinamide | CHEMBL328092
Type:
Small organic molecule
Emp. Form.:
C29H46N4O5
Mol. Mass.:
530.6993
SMILES:
Cc1ccc(CCC[C@H](CC(=O)NO)C(=O)N[C@@H](CC2CCCCC2)C(=O)NCCN2CCOCC2)cc1
: