Target
Gag-Pol polyprotein [489-587]
Ligand
BDBM50014144
Substrate
Meas. Tech.
ChEMBL_79954 (CHEMBL687725)
IC50
<1±n/a nM
Citation
 Mazaleyrat, JPRage, IŠavrda, JMouna, MWakselman, MBoulay, RLelièvre, Y Synthesis of C2-symmetric inhibitors of the HIV-1 protease, with N,N′-substituted ethylenediamide and ethylenediamine linkers. Bioorg Med Chem Lett 4:653-656 (1994)    Article 
Target
Name:
Gag-Pol polyprotein [489-587]
Synonyms:
Human immunodeficiency virus type 1 protease Pol polyprotein | gag-pol
Type:
Enzyme Subunit
Mol. Mass.:
10781.16
Organism:
Human immunodeficiency virus type 1
Description:
P04585[489-587]
Residue:
99
  
Inhibitor
Name:
BDBM50014144
Synonyms:
CHEMBL83462 {1-[1-Benzyl-4-(2-benzyloxycarbonylamino-3-methyl-butyrylamino)-2,3-dihydroxy-5-phenyl-pentylcarbamoyl]-2-methyl-propyl}-carbamic acid benzyl ester
Type:
Small organic molecule
Emp. Form.:
C44H54N4O8
Mol. Mass.:
766.9216
SMILES:
CC(C)[C@H](NC(=O)OCc1ccccc1)C(=O)N[C@@H](Cc1ccccc1)[C@@H](O)[C@H](O)[C@H](Cc1ccccc1)NC(=O)[C@H](NC(=O)OCc1ccccc1)C(C)C
: