Target
Type-1 angiotensin II receptor
Ligand
BDBM50284465
Substrate
Meas. Tech.
ChEMBL_36632 (CHEMBL652343)
IC50
12±n/a nM
Citation
 Walsh, TFFitch, KJChang, RSFaust, KAChen, TBKivlighn, SDZingaro, GJLotti, VJSiegl, PKPatchett, AAGreenlee, WJ α-Phenoxyphenylacetic acid derived angiotensin II antagonists with low nanomolar AT1/AT2 receptor subtype affinity (Part II) Bioorg Med Chem Lett 5:1151-1154 (1995)    Article 
Target
Name:
Type-1 angiotensin II receptor
Synonyms:
AGTR1 ANGIOTENSIN AT1 Angiotensin II type 1a (AT-1a) receptor
Type:
Enzyme Catalytic Domain
Mol. Mass.:
41009.15
Organism:
RABBIT
Description:
ANGIOTENSIN AT1 AGTR1 RABBIT::P34976
Residue:
359
  
Inhibitor
Name:
BDBM50284465
Synonyms:
CHEMBL15847 | [2-Butyl-4-(2-ethyl-5,7-dimethyl-imidazo[4,5-b]pyridin-3-ylmethyl)-phenoxy]-phenyl-acetic acid
Type:
Small organic molecule
Emp. Form.:
C29H33N3O3
Mol. Mass.:
471.5906
SMILES:
CCCCc1cc(Cn2c(CC)nc3c(C)cc(C)nc23)ccc1OC(C(O)=O)c1ccccc1
: