Target
Type-2 angiotensin II receptor
Ligand
BDBM50284465
Substrate
Meas. Tech.
ChEMBL_36768 (CHEMBL650291)
IC50
140±n/a nM
Citation
 Walsh, TFFitch, KJChang, RSFaust, KAChen, TBKivlighn, SDZingaro, GJLotti, VJSiegl, PKPatchett, AAGreenlee, WJ α-Phenoxyphenylacetic acid derived angiotensin II antagonists with low nanomolar AT1/AT2 receptor subtype affinity (Part II) Bioorg Med Chem Lett 5:1151-1154 (1995)    Article 
Target
Name:
Type-2 angiotensin II receptor
Synonyms:
AGTR2_RAT Agtr2 Angiotensin II receptor Type-2 angiotensin II receptor
Type:
Enzyme Catalytic Domain
Mol. Mass.:
41346.62
Organism:
RAT
Description:
Angiotensin II AT2 0 0::P35351
Residue:
363
  
Inhibitor
Name:
BDBM50284465
Synonyms:
CHEMBL15847 | [2-Butyl-4-(2-ethyl-5,7-dimethyl-imidazo[4,5-b]pyridin-3-ylmethyl)-phenoxy]-phenyl-acetic acid
Type:
Small organic molecule
Emp. Form.:
C29H33N3O3
Mol. Mass.:
471.5906
SMILES:
CCCCc1cc(Cn2c(CC)nc3c(C)cc(C)nc23)ccc1OC(C(O)=O)c1ccccc1
: