Target
Cysteinyl leukotriene receptor 1
Ligand
BDBM50284689
Substrate
Meas. Tech.
ChEMBL_99988 (CHEMBL710513)
Ki
20±n/a nM
Citation
 Marfat, AChambers, RCheng, JCooper, KDamon, DDelehunt, JEggler, JMasamune, HMelvin, LWatson, J The discovery of CP-96,021 and CP-96,486, balanced, combined, potent and orally active leukotriene D4 (LTD4)/platelet activating factor (PAF) receptor antagonists. Bioorg Med Chem Lett 5:1377-1382 (1995)    Article 
Target
Name:
Cysteinyl leukotriene receptor 1
Synonyms:
CLTR1_CAVPO | CYSLTR1
Type:
Enzyme Catalytic Domain
Mol. Mass.:
39007.58
Organism:
GUINEA PIG
Description:
Leukotriene D4 0 GUINEA PIG::Q2NNR5
Residue:
340
  
Inhibitor
Name:
BDBM50284689
Synonyms:
7-Chloro-2-((E)-2-{3-[4-(2-methyl-imidazo[4,5-c]pyridin-1-yl)-phenoxymethyl]-phenyl}-vinyl)-quinoline CP-96486
Type:
Small organic molecule
Emp. Form.:
C31H23ClN4O
Mol. Mass.:
502.994
SMILES:
Cc1nc2cnccc2n1-c1ccc(OCc2cccc(\C=C\c3ccc4ccc(Cl)cc4n3)c2)cc1
: