Target
Platelet-activating factor receptor
Ligand
BDBM50284690
Substrate
Meas. Tech.
ChEBML_155153
Ki
37±n/a nM
Citation
 Marfat, AChambers, RCheng, JCooper, KDamon, DDelehunt, JEggler, JMasamune, HMelvin, LWatson, J The discovery of CP-96,021 and CP-96,486, balanced, combined, potent and orally active leukotriene D4 (LTD4)/platelet activating factor (PAF) receptor antagonists. Bioorg Med Chem Lett 5:1377-1382 (1995)    Article 
Target
Name:
Platelet-activating factor receptor
Synonyms:
PAF-R PTAFR_CAVPO Platelet-activating factor receptor
Type:
Protein
Mol. Mass.:
39005.63
Organism:
Cavia porcellus
Description:
Residue:
342
  
Inhibitor
Name:
BDBM50284690
Synonyms:
1-(4-{3-[(E)-2-(5-Fluoro-benzothiazol-2-yl)-vinyl]-benzyloxy}-phenyl)-2-methyl-1H-imidazo[4,5-c]pyridine CP-96021
Type:
Small organic molecule
Emp. Form.:
C29H21FN4OS
Mol. Mass.:
492.567
SMILES:
Cc1nc2cnccc2n1-c1ccc(OCc2cccc(\C=C\c3nc4cc(F)ccc4s3)c2)cc1
: