Target
Histamine H1 receptor
Ligand
BDBM50284689
Substrate
Meas. Tech.
ChEBML_84869
IC50
>10000±n/a nM
Citation
 Marfat, AChambers, RCheng, JCooper, KDamon, DDelehunt, JEggler, JMasamune, HMelvin, LWatson, J The discovery of CP-96,021 and CP-96,486, balanced, combined, potent and orally active leukotriene D4 (LTD4)/platelet activating factor (PAF) receptor antagonists. Bioorg Med Chem Lett 5:1377-1382 (1995)    Article 
Target
Name:
Histamine H1 receptor
Synonyms:
H1R HISTAMINE H1 HRH1_HUMAN
Type:
G Protein-Coupled Receptor (GPCR)
Mol. Mass.:
55808.72
Organism:
Homo sapiens (Human)
Description:
Cell pellets from SK-N-MC cells transfected with human H1 receptor were used in binding assay.
Residue:
487
  
Inhibitor
Name:
BDBM50284689
Synonyms:
7-Chloro-2-((E)-2-{3-[4-(2-methyl-imidazo[4,5-c]pyridin-1-yl)-phenoxymethyl]-phenyl}-vinyl)-quinoline CP-96486
Type:
Small organic molecule
Emp. Form.:
C31H23ClN4O
Mol. Mass.:
502.994
SMILES:
Cc1nc2cnccc2n1-c1ccc(OCc2cccc(\C=C\c3ccc4ccc(Cl)cc4n3)c2)cc1
: