Target
Serotonin 2 (5-HT2) receptor
Ligand
BDBM50284689
Substrate
Meas. Tech.
ChEMBL_2212 (CHEMBL617037)
IC50
>10000±n/a nM
Citation
 Marfat, AChambers, RCheng, JCooper, KDamon, DDelehunt, JEggler, JMasamune, HMelvin, LWatson, J The discovery of CP-96,021 and CP-96,486, balanced, combined, potent and orally active leukotriene D4 (LTD4)/platelet activating factor (PAF) receptor antagonists. Bioorg Med Chem Lett 5:1377-1382 (1995)    Article 
Target
Name:
Serotonin 2 (5-HT2) receptor
Synonyms:
5-hydroxytryptamine receptor 2A/2B/2C
Type:
Mol. Mass.:
Description:
ASSAY_ID of ChEMBL is 2197423
Components:
This complex has 3 components.
Component 1
Name:
5-hydroxytryptamine receptor 2B
Synonyms:
5-HT-2B 5-hydroxytryptamine (serotonin) receptor 2B [Homo sapiens] 5-hydroxytryptamine receptor 2C (5HT2C) HTR2B Serotonin 2b (5-HT2b) receptor | Serotonin Receptor 2B
Type:
G Protein-Coupled Receptor (GPCR)
Mol. Mass.:
54312.47
Organism:
Homo sapiens (Human)
Description:
Receptor binding assays were performed using human clone stably expressed in CHO cells.
Residue:
481
  
Component 2
Name:
5-hydroxytryptamine receptor 2A
Synonyms:
5-HT-2 5-HT2A 5-hydroxytryptamine receptor 2A (5HT-2A) 5HT2A_HUMAN HTR2A | Serotonin receptor 2A
Type:
undefined
Mol. Mass.:
52607.65
Organism:
Homo sapiens (Human)
Description:
P28223
Residue:
471
  
Component 3
Name:
5-hydroxytryptamine receptor 2C
Synonyms:
5-HT-1C 5-HT1C 5-HT2C-INI 5-HTR2C 5-hydroxytryptamine receptor 2C (5-HT-2C) 5HT-1C HTR1C Serotonin (5-HT3) receptor Serotonin Receptor 2C
Type:
G Protein-Coupled Receptor (GPCR)
Mol. Mass.:
51836.79
Organism:
Homo sapiens (Human)
Description:
P28335
Residue:
458
  
Inhibitor
Name:
BDBM50284689
Synonyms:
7-Chloro-2-((E)-2-{3-[4-(2-methyl-imidazo[4,5-c]pyridin-1-yl)-phenoxymethyl]-phenyl}-vinyl)-quinoline CP-96486
Type:
Small organic molecule
Emp. Form.:
C31H23ClN4O
Mol. Mass.:
502.994
SMILES:
Cc1nc2cnccc2n1-c1ccc(OCc2cccc(\C=C\c3ccc4ccc(Cl)cc4n3)c2)cc1
: