Target
Leukotriene B4 receptor 1
Ligand
BDBM50285073
Substrate
Meas. Tech.
ChEMBL_98502 (CHEMBL709164)
Ki
28±n/a nM
Citation
 Sofia, MJNelson, KHerron, DKGoodson, TFroelich, LLSpaethe, SMMarder, PRoman, CRFleisch, JH 2-alkyl-4-ethyl-5-[6-methyl-6-(2H-tetrazol-5-yl)heptyloxy]phenol leukotriene B4 receptor antagonists Bioorg Med Chem Lett 5:1995-2000 (1995)    Article 
Target
Name:
Leukotriene B4 receptor 1
Synonyms:
BLT BLTR Chemoattractant receptor-like 1 GPR16 LTB4-R 1 Leukotriene B4 R1 Leukotriene B4 receptor 1 P2Y purinoceptor 7 | P2Y7
Type:
Enzyme Catalytic Domain
Mol. Mass.:
37582.68
Organism:
Homo sapiens (Human)
Description:
Q15722
Residue:
352
  
Inhibitor
Name:
BDBM50285073
Synonyms:
CHEMBL58794 | sodium 4-ethyl-2-hexyl-5-[6-methyl-6-(2H-1,2,3,4-tetraazol-5-yl)heptyloxy]phenol
Type:
Small organic molecule
Emp. Form.:
C23H37N4O2
Mol. Mass.:
401.566
SMILES:
CCCCCCc1cc(CC)c(OCCCCCC(C)(C)c2nn[n-]n2)cc1O
: