Target
Vasopressin V1a receptor
Ligand
BDBM50285293
Substrate
Meas. Tech.
ChEMBL_214549 (CHEMBL820018)
IC50
520±n/a nM
Citation
 Hobbs, DWGould, NPHoffman, JBClineschmidt, BVPettibone, DJVeber, DFFreidinger, RM Non-peptide oxytocin antagonists: identification and synthesis of a potent camphor aminosuccinimide Bioorg Med Chem Lett 5:119-122 (1995)    Article 
Target
Name:
Vasopressin V1a receptor
Synonyms:
Avpr1a VASOPRESSIN V1A Vasopressin V1a receptor | Vasopressin receptor
Type:
Enzyme Catalytic Domain
Mol. Mass.:
47674.81
Organism:
RAT
Description:
VASOPRESSIN V1A AVPR1A RAT::P30560
Residue:
424
  
Inhibitor
Name:
BDBM50285293
Synonyms:
1-[7,7-dimethyl-1-spiro[2,3-dihydro-1H-indene-1,4'-(hexahydropyridine)]-1-ylsulfonylmethyl-(1S,2S)-bicyclo[2.2.1]hept-2-yl]-3-[2-hydroxy-(2R)-propylamino]tetrahydro-1H-2,5-pyrroledione | CHEMBL279281
Type:
Small organic molecule
Emp. Form.:
C30H43N3O5S
Mol. Mass.:
557.745
SMILES:
C[C@@H](O)CNC1CC(=O)N([C@H]2CC3CC[C@]2(CS(=O)(=O)N2CCC4(CCc5ccccc45)CC2)C3(C)C)C1=O
: