Target
Vasopressin V2 receptor
Ligand
BDBM50285301
Substrate
Meas. Tech.
ChEMBL_214877 (CHEMBL820243)
IC50
7140±n/a nM
Citation
 Hobbs, DWGould, NPHoffman, JBClineschmidt, BVPettibone, DJVeber, DFFreidinger, RM Non-peptide oxytocin antagonists: identification and synthesis of a potent camphor aminosuccinimide Bioorg Med Chem Lett 5:119-122 (1995)    Article 
Target
Name:
Vasopressin V2 receptor
Synonyms:
AVPR V2 Avpr2 V2R_RAT Vasopressin receptor
Type:
G-protein coupled receptor
Mol. Mass.:
40761.85
Organism:
Rattus norvegicus (Rat)
Description:
Residue:
371
  
Inhibitor
Name:
BDBM50285301
Synonyms:
3-diethylamino-1-[7,7-dimethyl-1-spiro[2,3-dihydro-1H-indene-1,4'-(hexahydropyridine)]-1-ylsulfonylmethyl-(1S,2S)-bicyclo[2.2.1]hept-2-yl]-(3R)-tetrahydro-1H-2,5-pyrroledione | CHEMBL280202
Type:
Small organic molecule
Emp. Form.:
C31H45N3O4S
Mol. Mass.:
555.772
SMILES:
CCN(CC)[C@@H]1CC(=O)N([C@H]2CC3CC[C@]2(CS(=O)(=O)N2CCC4(CCc5ccccc45)CC2)C3(C)C)C1=O
: